BDBM50464455 CHEMBL4294528::US11565996, Compound Colletochlorin B
SMILES [#6]\[#6](-[#6])=[#6]\[#6]-[#6]\[#6](-[#6])=[#6]\[#6]-c1c(-[#8])c(Cl)c(-[#6])c(-[#6]=O)c1-[#8]
InChI Key InChIKey=UEUMAXMCCDEOIJ-XYOKQWHBSA-N
Data  4 IC50
PDB links: 2 PDB IDs match this monomer.
  Tab Delimited (TSV)   2D SDfile   Computed 3D by Vconf -m prep SDfile
Find this compound or compounds like it in BindingDB:
Activity Spreadsheet -- Enzyme Inhibition Constant Data from BindingDB
Found 2 hits for monomerid = 50464455
TargetAlternative oxidase, mitochondrial(Trypanosoma brucei brucei)
University Of Sussex
Curated by ChEMBL
LigandPNGBDBM50464455(CHEMBL4294528 | US11565996, Compound Colletochlori...)
Affinity DataIC50:  4nM. Assay description: Inhibition of recombinant His-tagged and SUMO-tagged Trypanosoma alternative oxidase expressed in Escherichia coli Rosetta2 using 1-ubiquinol as subs...
Ligand InfoPC cidPC sidPDB
TargetAlternative oxidase, mitochondrial(Trypanosoma brucei brucei)
University Of Sussex
Curated by ChEMBL
LigandPNGBDBM50464455(CHEMBL4294528 | US11565996, Compound Colletochlori...)
Affinity DataIC50:  3.98nM. Assay description: Inhibition of recombinant His-tagged and SUMO-tagged Trypanosoma alternative oxidase expressed in Escherichia coli Rosetta2 using 1-ubiquinol as subs...
Ligand InfoPC cidPC sidPDB